{"text_format":"3","workbook":"xlsx","n_sheets":3,"sheets":["Demo","Afrique","Drapeaux"],"not_rendered":{"charts":1,"images":13,"macros":1,"defined_names":2},"read":"whole","date_system":"1900"}

{"sheet":"Demo","index":0,"n_rows":103,"n_cols":39,"rows_kept":103,"merged":[[24,2,24,3],[24,5,24,6],[63,1,63,2],[89,5,90,7],[91,5,93,7],[95,5,96,7],[103,4,104,6]]}
[]
[]
[null,null,"Pays","janv","fév","mars"]
[null,null,"A"]
[null,null,"B",{"$nulls":3},"Ctrl+v = vide"]
[null,null,"C",{"$nulls":3},"Ctrl+a = valeurs1"]
[null,null,"D",{"$nulls":3},"Ctrl+b = valeurs2"]
[]
[]
[]
[]
[]
[{"$nulls":5},false]
{"$rows_empty":11}
[null,null,"Caisse",null,null,"Poste"]
[{"$nulls":5},{"v":500,"d":"500.00"}]
[]
[]
[null,null,{"$f":"IF(SUM(D26:D28)>SUM(C26:C28),SUM(D26:D28)-SUM(C26:C28),\"\")","v":""},{"$f":"IF(SUM(C26:C28)>SUM(D26:D28),SUM(C26:C28)-SUM(D26:D28),\"\")","v":""},null,{"$f":"IF(SUM(G26:G28)>SUM(F26:F28),SUM(G26:G28)-SUM(F26:F28),\"\")","v":""},{"$f":"IF(SUM(F26:F28)>SUM(G26:G28),SUM(F26:F28)-SUM(G26:G28),\"\")","v":{"v":500,"d":"500.00"}}]
[null,null,{"$f":"SUM(C26:C29)","v":{"v":0,"d":"0.00"}},{"$f":"C30","v":{"v":0,"d":"0.00"}},null,{"$f":"SUM(F26:F29)","v":{"v":500,"d":"500.00"}},{"$f":"F30","v":{"v":500,"d":"500.00"}}]
[]
[]
[]
[null,null,"Ecriture : retiré 200.- du CP"]
[]
[null,null,"Bouclement"]
{"$rows_empty":24}
[null,null,1]
[null,"Cliquez sur",{"$f":"VLOOKUP(C61,Zone,2)","v":"l'Algérie"},null,"Bravo !"]
[{"$nulls":37},1,"l'Algérie"]
[null,"Non, vous n'y êtes pas !",{"$nulls":35},2,"le Mali"]
[null,1,{"$nulls":35},3,"la Guinée"]
[{"$nulls":37},4,"la Côte d'Ivoire"]
[{"$nulls":37},5,"le Burkina Faso"]
[{"$nulls":37},6,"le Ghana"]
[{"$nulls":37},7,"le Benin"]
[{"$nulls":37},8,"le Nigeria"]
[{"$nulls":5},"gi-li-ci-gh--be-ni",{"$nulls":31},9,"le Gabon"]
[{"$nulls":5},"ga-ca-co-ou-ke",{"$nulls":31},10,"le Congo"]
[{"$nulls":5},"an-za-ta",{"$nulls":31},11,"l'Angola"]
[{"$nulls":5},"na-bo-zi-mo",{"$nulls":31},12,"la Namibie"]
[{"$nulls":5},"as",{"$nulls":31},13,"le Botswana"]
[{"$nulls":37},14,"le Zimbabwe"]
[{"$nulls":37},15,"la Somalie"]
{"$rows_empty":12}
[{"$nulls":5},{"$f":"HLOOKUP(F103,Drapeaux!C5:I7,2)","v":"bonjour / salut"}]
[]
[{"$nulls":5},{"$f":"HLOOKUP(F103,Drapeaux!C5:I7,3)","v":"bienvenue"}]
[]
[]
[]
[{"$nulls":5},{"$f":"HLOOKUP(F103,Drapeaux!C5:I8,4)","v":"merci !"}]
[]
[]
[]
[]
[]
[]
[{"$nulls":5},1]

{"sheet":"Afrique","index":1,"n_rows":0,"n_cols":0,"rows_kept":0}

{"sheet":"Drapeaux","index":2,"n_rows":8,"n_cols":9,"rows_kept":8}
[]
[]
[]
[]
[null,null,1,2,3,4,5,6,7]
[null,null,"bonjour / salut","guten Tag / hallo","good day / hello","buongiorno / ciao","buenos dias / hola","bom dia / olà","god dag /  hej"]
[null,null,"bienvenue","herzlich willkommen","welcome","benvenuto","bienvenido","bem-vindo","välkommen"]
[null,null,"merci !","danke !","thank you !","grazie !","gracias !","obrigado !","tack !"]