{"text_format":"1","workbook":"xlsx","n_sheets":8,"sheets":["Accueil","Bureau Direction","Information","Comptabilité","Presse","Palmarès","Calculs","Synthèse"],"not_rendered":{"charts":2,"images":48,"macros":1,"external_links":0,"defined_names":13,"comments":1,"pivot_tables":0},"unopened":[],"bounds":{"document_bytes":16777216,"sheet_cells":100000,"rows_first":2000,"rows_last":500,"rows_between":2000,"halvings":0,"cell_chars":16384,"cell_head_chars":4096},"cells_cut":0,"cells_raw":0,"read":"whole","date_system":"1900"}

{"sheet":"Accueil","index":0,"n_rows":41,"n_cols":27,"rows_kept":41,"cut":false,"hidden":false,"merged":[[35,9,35,10],[13,7,14,11],[26,0,26,2],[39,4,39,7],[28,1,28,3],[17,9,18,11],[35,7,35,8],[19,10,19,11],[20,10,20,11],[21,10,21,11],[34,2,34,5],[34,9,34,10],[1,7,2,11],[3,7,5,11],[6,7,9,11],[10,7,12,11],[31,8,31,10],[22,10,22,11]]}
[]
[null,2,null,0,null,1,null,"Jeu d'entreprise"]
[]
[null,null,null,null,null,null,null,"Vous pouvez exercer vos talents de gestionnaire sur ce programme de simulation financière."]
[]
[]
[null,null,null,null,null,null,null,"Vous venez de créer votre ordinateur et il vous faut le commercialiser en série. Et surtout le vendre, malgré une terrible concurrence !"]
[]
[]
[null,null,null,null,null,null,null,null,null,null,null,null,null,null,null,null,null,null,null,null,null,null,null,null,null,null,2]
{"$rows_left_out":32}
{"sheet":"Bureau Direction","index":1,"n_rows":54,"n_cols":85,"rows_kept":54,"cut":false,"hidden":false,"merged":[[39,50,39,53],[10,9,10,10],[9,54,11,54],[9,55,11,55],[9,49,11,49],[9,11,9,12],[9,48,11,48],[9,47,11,47],[9,45,11,45],[29,28,30,28],[29,32,30,32],[31,26,31,32],[29,30,30,30],[29,31,30,31],[29,29,30,29],[25,20,25,23],[9,56,11,56],[9,53,11,53],[9,50,11,50],[9,52,11,52],[9,51,11,51],[19,50,19,53],[16,13,16,14],[9,30,11,30],[9,31,11,31],[12,7,12,9],[13,7,13,9],[14,7,14,9],[15,7,15,9],[18,35,18,46],[9,4,9,10],[17,13,17,14],[18,12,19,12],[10,3,10,8],[9,60,9,71],[9,73,9,84],[23,31,23,33],[9,38,11,38],[9,39,11,39],[9,36,11,36],[9,35,11,35],[9,44,11,44],[9,43,11,43],[22,31,22,33],[21,31,21,33],[20,31,20,33],[9,41,11,41],[9,37,11,37],[9,46,11,46],[9,57,11,57],[0,5,0,19],[3,18,3,19],[4,18,5,19],[7,18,7,19],[3,11,3,12],[4,11,4,12],[5,11,7,11],[7,9,7,10],[1,29,2,29],[1,26,2,26],[45,42,45,43],[40,35,40,37],[26,43,26,46],[35,43,35,44],[36,43,36,44],[26,35,26,39],[41,44,41,45],[44,28,44,32],[45,28,45,32],[40,28,40,32],[42,28,42,32],[43,28,43,32],[41,28,41,32],[1,30,1,41],[6,30,6,31],[9,40,11,40],[8,11,8,12],[14,18,14,19],[29,27,30,27],[15,13,15,14],[22,20,22,23],[23,20,23,23],[24,20,24,23],[26,20,26,23],[8,30,8,43],[9,32,11,32],[9,33,11,33],[9,34,11,34],[9,42,11,42],[35,33,35,34],[13,12,13,15],[31,5,31,8],[30,5,30,8],[32,5,32,8],[16,7,16,9],[33,5,33,8],[34,5,34,8],[35,5,35,8],[17,7,17,9]]}
[null,null,null,null,null,{"$f":"\"Entreprise \" & VLOOKUP(AA9,AE21:AH24,2)","v":"Entreprise Cheetha"},null,null,null,null,null,null,null,null,null,null,null,null,null,null,null,null,null,null,null,null,"col.27","Echéance version évaluation",null,null,"col.31",32,33,34,35,36,37,38,39,40,41,42,43,44,45,46,47,48,49,50,51,52,53,54]
[null,null,null,null,null,null,null,null,null,null,null,null,null,null,null,null,null,null,null,null,null,null,null,null,null,null,"Paramètres globaux",{"$f":"IF(TODAY()>DATE(2003,7,14),1,0)","v":1},null,null,"Constantes mensuelles (Datamens)"]
[null,null,null,null,null,null,null,null,null,null,null,null,"Etat",null,"Décisions",null,null,null,null,null,null,null,null,null,null,null,null,null,null,null,1,2,3,4,5,6,7,8,9,10,11,12,13,14,null,null,null,null,null,93356.666666666672,null,null,400]
[null,null,null,null,"Ouvriers à engager",null,null,null,null,null,null,{"$f":"VLOOKUP(AA$9,Datavar,2)","v":50},null,null,null,"ouvriers",null,null,{"$f":"HLOOKUP(AA12,Datamens,2)","v":"janvier"},null,null,{"$f":"IF(S5=31,\"Fin de partie\",\"\")","v":""},null,null,null,null,null,"Presse",4,null,"janvier","février","mars","avril","mai","juin","juillet","août","septembre","octobre","novembre","décembre","décembre","FIN",null,null,null,null,null,1534]
[null,null,null,null,"Matière à acheter ",null,null,null,null,null,null,{"$f":"VLOOKUP(AA$9,Datavar,4)","v":0},null,null,null,"unités",null,null,{"$f":"HLOOKUP(AA12,Datamens,3)","v":1},null,null,null,null,null,null,null,"nb entrep. ",null,"ouv o/n",null,1,1,1,1,1,1,1,1,1,1,1,1,25]
[null,null,null,null,"Publicité",null,null,null,null,null,null,"Total",{"$f":"IF(AB7=TRUE,VLOOKUP(AA$9,Datavar,5),\"\")","v":""},null,null,"fr. ",null,null,null,null,null,null,null,null,null,null,{"$f":"AF25","v":1},"Vu ",{"$f":"IF(O8<0,1,0)","v":0},"Placem"]
[null,null,null,null,"Recherche",null,null,null,null,null,null,null,{"$f":"IF(AB8=TRUE,VLOOKUP(AA$9,Datavar,6),\"\")","v":""},null,null,"fr.",null,null,null,null,null,null,null,null,null,null,null,false,{"$f":"IF($O$4>100,IF(VLOOKUP(AA9,Datavar,6)<3599,1,0),0)","v":0},null,"Nouvelle année",null,0]
[null,null,null,null,"Placements",null,null,null,null,{"$f":"AC21&\" %\"","v":"12 %"},null,null,{"$f":"VLOOKUP(AA$9,Datavar,23)","v":0},null,null,"fr.",null,null,{"$f":"AC12","v":26},null,null,null,null,null,null,null,"ent. Active",false,{"$f":"IF($O$4>200,IF(VLOOKUP(AA9,Datavar,6)<6599,1,0),0)","v":0}]
[null,null,null,null,"Prix de vente",null,null,null,null,null,null,{"$f":"IF(AB9=TRUE,VLOOKUP(AA$9,Datavar,7),\"\")","v":""},null,null,null,"unitaire",null,null,null,null,null,null,null,null,null,null,1,false,{"$f":"SUM(AC6:AC8)","v":0},null,"Variables (Datavar)"]
[null,null,null,null,"Evolution de votre marché",null,null,null,null,null,null,{"$f":"ROUND(((M19-VLOOKUP(AA$9,Datavar,20))*100)/VLOOKUP(AA$9,Datavar,20),1)&\" %\"","v":"0 %"},null,null,155,null,null,null,"MO",{"$f":"IF(AD24=1,\"\",IF(O5=0,\"\",(L4+O4)*AA27/O5))","v":""},null,null,null,null,null,null,null,null,null,null,"Entre-prises no","Nb. Ouvriers","Produc- tivité","Mat. 1ère en stock","Publicité","Recher- che","Prix de vente","Prod. En sock","Liquidité","Vente du mois","Marché","Matière achetée","Produc- tion","Total des ventes","Recher- che du mois","Drapeau faillite","Total achats","Tarif march.","Tarif salaires","Marché précédent","Commande du mois","Pub du mois","Placements","Intérêts courus","Achats du mois","Prix march","Prix salaires","Bén. du mois",null,null,"Parts de marché",null,null,null,null,null,null,null,null,null,null,null,null,"Evolution du cash + placements"]
{"$rows_left_out":45}
{"sheet":"Information","index":2,"n_rows":25,"n_cols":30,"rows_kept":25,"cut":false,"hidden":false,"merged":[[28,7,28,8],[5,0,5,1],[14,11,14,14],[15,11,15,14]]}
[]
[]
[]
[]
[]
[]
[null,null,null,null,null,null,null,null,null,null,null,null,null,null,null,null,null,null,null,null,null,null,null,null,null,null,null,false]
[null,null,null,null,null,null,null,null,null,null,null,null,null,null,null,null,null,null,null,null,null,null,null,null,null,null,null,false]
[null,null,null,null,null,null,null,null,null,null,null,null,null,0,null,null,null,null,null,null,null,null,null,null,null,null,null,false]
[]
{"$rows_left_out":16}
{"sheet":"Comptabilité","index":3,"n_rows":19,"n_cols":29,"rows_kept":19,"cut":false,"hidden":false,"merged":[[18,11,18,13],[18,3,18,10],[5,3,5,8],[5,10,5,15],[16,15,17,15],[16,10,17,14],[16,6,17,8],[16,3,17,5],[9,0,10,0],[9,1,10,1],[7,0,7,1],[8,0,8,1],[1,26,1,27],[3,3,3,10],[3,11,3,15]]}
[{"$f":"'Bureau Direction'!AA12","v":1},{"$f":"'Bureau Direction'!AA9","v":1}]
[null,null,null,null,null,null,null,null,null,null,null,{"$f":"VLOOKUP(AB4,'Bureau Direction'!$AE$21:$AH$24,2)","v":"Cheetha"},null,null,null,null,null,null,null,null,null,null,null,"Mois pour le titre",null,null,"Variable GLOB"]
[null,null,null,null,null,null,null,null,null,null,null,null,null,null,null,null,null,null,null,null,null,null,null,1,"janvier",{"$f":"IF($AB$3<X3,\"\",Y3)","v":"janvier"},"Actif mois /firm",{"$f":"A1","v":1},{"$f":"B1","v":1}]
[null,null,null,"Compte d'exploitation en",null,null,null,null,null,null,null,{"$f":"VLOOKUP(AB5,X3:Y15,2)","v":"janvier"},null,null,null,null,null,null,null,null,null,null,null,2,"février",{"$f":"IF($AB$3<X4,\"\",Y4)","v":""},"Firm compta",1]
[null,null,null,null,null,null,null,null,null,null,null,null,null,null,null,null,null,null,null,null,null,null,null,3,"mars",{"$f":"IF($AB$3<X5,\"\",Y5)","v":""},"Mois compta",1]
[null,null,null,"CHARGES",null,null,null,null,null,null,"PRODUITS",null,null,null,null,null,null,null,null,null,null,null,null,4,"avril","","Achats"]
[null,null,null,"Achat",{"$f":"AB6","v":0},"x",{"$f":"AB7","v":0},".-",{"$f":"E7*G7","v":0},null,"Chiffre d'affaires",{"$f":"AB12","v":0},"x",{"$f":"AB13","v":0},".-",{"$f":"L7*N7","v":0},null,null,null,null,null,null,null,5,"mai","","Prix achat"]
["Production",null,null,{"$f":"IF(I8=\"\",\"\",\"Marge brut\")","v":""},null,null,null,null,{"$f":"IF(P7>I7,P7-I7,\"\")","v":""},null,{"$f":"IF(P8=\"\",\"\",\"Perte brute\")","v":""},null,null,null,null,{"$f":"IF(I7>P7,I7-P7,\"\")","v":""},null,null,null,null,null,null,null,6,"juin","","Salaires"]
[{"$f":"AB14","v":0},null,null,null,null,null,null,null,{"$f":"SUM(I7:I8)","v":0},null,null,null,null,null,null,{"$f":"SUM(P7:P8)","v":0},null,null,null,null,null,null,null,7,"juillet","","Prix salaire"]
["PR :",{"$f":"I7+SUM(I12:I14)","v":0},null,null,null,null,null,null,null,null,null,null,null,null,null,null,null,null,null,null,null,null,null,8,"août","","Pub"]
{"$rows_left_out":10}
{"sheet":"Presse","index":4,"n_rows":49,"n_cols":37,"rows_kept":49,"cut":false,"hidden":false,"merged":[[28,9,28,10],[4,26,4,27],[26,2,26,8],[7,2,8,4],[9,2,9,4],[9,26,9,30],[7,6,16,6],[16,27,16,30],[10,2,22,2],[10,4,22,4]]}
[null,null,null,null,null,null,null,null,null,null,null,null,null,null,"Entreprise no",{"$f":"'Bureau Direction'!AA9","v":1},"Nom :",{"$f":"VLOOKUP(P1,'Bureau Direction'!AE20:AH24,2)","v":"Cheetha"},"Nb Employés",{"$f":"'Bureau Direction'!L4","v":50},null,null,null,null,"Faillite :",{"$f":"VLOOKUP(P1,Datavar,16)","v":0},{"$f":"RANK(AC1,$AC$1:$AC$4)","v":1},{"$f":"C28","v":"Cheetha"},{"$f":"C29","v":0},{"$f":"C30","v":0}]
[null,null,"  ",null,null,null,null,null,"Sommaire",null,null,null,null,null,"Commentaire no",{"$f":"'Bureau Direction'!AC4","v":4},4,null,null,null,null,null,null,null,{"$f":"'Bureau Direction'!H14","v":1000},null,{"$f":"RANK(AC2,$AC$1:$AC$4)","v":1},{"$f":"E28","v":0},{"$f":"E29","v":0},{"$f":"E30","v":0},null,null,null,null,"Journal, groupement des lignes"]
[null,null," ",null,null,null,null,null,null,null,null,null,null,null,"Articles","Innovation","Stock","Résultat","Intro","Tarif2","Fourchette","Tuile",null,null,null,null,{"$f":"RANK(AC3,$AC$1:$AC$4)","v":1},{"$f":"G28","v":0},{"$f":"G29","v":0},{"$f":"G30","v":0}]
[null,null,null,null,null,null,null,null,null,null,null,null,null,null,"largeur 21 svp",1,2,3,4,5,6,7,8,9,10,null,{"$f":"RANK(AC4,$AC$1:$AC$4)","v":1},{"$f":"I28","v":0},{"$f":"I29","v":0},{"$f":"I30","v":0}]
[null,null," ",null,null,null,null,null,null,null,null,null,null,null,0,"L'innovation","Les stock de marchandises",{"$f":"AC12","v":"Cheetha"},"Smak - Money","Marché du travail","L'offre et la demande","Malheurs des industriels","Licenciements","Le chien",{"$f":"\"Faillite de \"&R1","v":"Faillite de Cheetha"},1,{"$f":"AC12","v":"Cheetha"}]
[null,null,null,null,1,null,null,null,null,null,null,null,null,null,1,"Le moteur de la croissance","Faut-il des réserves ?","La meilleure entreprise d'ordinateurs","Jeu d'entreprise","La pénurie","ainsi que conjoncture influencent les prix","Vicissitudes de la productivité",{"$f":"\"chez \" & R1","v":"chez Cheetha"},"du patron",{"$f":"T1 &\" chômeurs techniques\"","v":"50 chômeurs techniques"},null,null,null,"Battu o/n"]
[null,null,null,null,null,null,2,null,null,null,null,null,null,null,2,"L'innovation technologique exige","La mode des flux tendus","Avec un cash flow (bénéfice","Pour profiter pleinement des","La forte demande de personnel","L'offre et la demande sont les","Lorsque la productivité augmente","Malgré le développement du secteur","Ce chien a du flair…et de l'intuition !","Depuis quelques semaines déjà",null,"Record :",{"$f":"Palmarès!U4","v":292215},{"$f":"IF(AD12>AB7,\"o\",\"n\")","v":"n"},null,null,null,null,null,{"$f":"VLOOKUP(2,Articles,$P$2+1)","v":"Pour profiter pleinement des"},{"$f":"VLOOKUP(15,Articles,$P$2+1)","v":"Si vous voulez jouer avec SMAK"},{"$f":"VLOOKUP(28,Articles,$P$2+1)","v":"Nous vous souhaitons beau-"}]
[null,null,{"$f":"VLOOKUP(0,Articles,P2+1)","v":"Smak - Money"},null,null,null,{"$f":"AK7&AK8&AK9&AK10&AK11&AK12&AK13&AK14&AK15&AK16&AK17&AK18&AK19","v":"Nous vous souhaitons beau- coup de plaisir avec Smak-money;  armez-vous d'une calculette et bonne chance !                       "},null,"                  Palmarès",null,null,null,null,null,3," souvent, en plus des investis-- sements"," pousse "," avant impôts et amortissements)"," potentialités du programme"," hyper-qualifié entraîne une"," principales grandeurs servant "," son coefficient  (le nombre d'ouvriers pour faire un ordinateur) diminue."," de l'informatique certains"," Caché sous le bureau du patron, il sort si"," les milieux économiques régio-",null,null,{"$f":"Palmarès!V4","v":3240},null,null,null,null,null,null,{"$f":"VLOOKUP(3,Articles,$P$2+1)","v":" potentialités du programme"},{"$f":"VLOOKUP(16,Articles,$P$2+1)","v":" comme adversaire virtuel, voici ce que vous"},{"$f":"VLOOKUP(29,Articles,$P$2+1)","v":" coup de plaisir avec Smak-money;"}]
[null,null,null,null,null,null,null,null,null,null,null,null,null,null,4," en capital, des investissements","les entrepreneurs à limiter les",{"$f":"\" de \"&AD12&\".-, l'entreprise\"","v":" de 0.-, l'entreprise"}," lisez le descriptif"," pénurie importante dans les"," à déterminer les prix dans"," L'idéal est d'arriver le plus vite"," fabricants d'ordinateurs"," vous jouez avec ses os.","naux étaient inquiets de la situation",null,null,null,null,null,null,null,null,null,{"$f":"VLOOKUP(4,Articles,$P$2+1)","v":" lisez le descriptif"},{"$f":"VLOOKUP(17,Articles,$P$2+1)","v":" devez faire :                      "},{"$f":"VLOOKUP(30,Articles,$P$2+1)","v":"  armez-vous d'une calculette et"}]
[null,null,{"$f":"VLOOKUP(1,Articles,P2+1)","v":"Jeu d'entreprise"},null,null,null,null,null,null,null,null,null,null,null,5," incorporels comme des achats de ","  stocks au strict minimum."," "," \"Smakmoney_info\"."," secteurs techniques."," l'éco- nomie. L'offre, c'est la volonté"," à 1."," n'hésitent pas à user"," Mais pour vous informer, voici quelques",{"$f":"\" précaire de la fabrique  \" & R1","v":" précaire de la fabrique  Cheetha"},null,"Liste classée",null,null,null,null,null,null,null,{"$f":"VLOOKUP(5,Articles,$P$2+1)","v":" \"Smakmoney_info\"."},{"$f":"VLOOKUP(18,Articles,$P$2+1)","v":"                     1)Dans la page d'accueil, sélectionnez"},{"$f":"VLOOKUP(31,Articles,$P$2+1)","v":" bonne chance !"}]
{"$rows_left_out":40}
{"sheet":"Palmarès","index":5,"n_rows":549,"n_cols":24,"rows_kept":549,"cut":false,"hidden":false,"merged":[[1,12,1,15],[1,19,1,22],[6,3,6,6],[3,0,3,2],[2,3,2,4],[3,3,3,4]]}
[null,null,null,null,null,null,null,null,null,null,null,null,"Nb éléments",{"$f":"COUNT(N4:N551)","v":11}]
[null,null,null,null,null,null,null,null,null,null,null,null,"DATARESUL",null,null,null,null,null,null,"DATAPREMIER"]
[null,null,null,"Entreprise",null,"Cash flow","Ventes",null,null,null,null,null,"Firme","Flow","Ordinateurs","Date",null,null,"Equivalent","Entreprise","Cash flow","Ventes","Date","erreur"]
[null,null,null,{"$f":"Presse!$AC$12","v":"Cheetha"},null,{"$f":"Presse!$AD$12","v":0},{"$f":"Presse!$AE$12","v":0},null,null,null,null,{"$f":"RANK(N4,$N$4:$N$551)","v":1},"HEWLEY",292215,3240,"2003-11-08T19:16:01",null,1,{"$f":"MATCH(R4,$L$4:$L$550,0)","v":1},{"$f":"INDEX(Dataresul,$S4,1)","v":"HEWLEY"},{"$f":"INDEX(Dataresul,$S4,2)","v":292215},{"$f":"INDEX(Dataresul,$S4,3)","v":3240},{"$f":"INDEX(Dataresul,$S4,4)","v":37933.802789351852},{"$f":"IF(ISERROR(T4),0,1)","v":1}]
[null,null,null,null,null,null,null,null,null,null,null,{"$f":"RANK(N5,$N$4:$N$551)","v":4},"COMPELL",212380,4120,"2002-12-15T18:27:47",null,2,11,{"$f":"INDEX(Dataresul,$S5,1)","v":"Cheetah"},{"$f":"INDEX(Dataresul,$S5,2)","v":250226},{"$f":"INDEX(Dataresul,$S5,3)","v":4118},{"$f":"INDEX(Dataresul,$S5,4)","v":38609.026944444442},{"$f":"IF(ISERROR(T5),0,1)","v":1}]
[null,null,null,null,null,null,null,null,null,null,null,{"$f":"RANK(N6,$N$4:$N$551)","v":11},"Smak",71862,809,"2002-12-13T23:16:40",null,3,10,"Cheetah",245796,2123,38579.132094907407,1]
[null,null,null,"Les 20 meilleurs résultats",null,null,null,null,null,null,null,{"$f":"RANK(N7,$N$4:$N$551)","v":7},"HEWLEY",177371,1176,"2002-12-20T22:12:01",null,4,2,"COMPELL",212380,4120,37605.769293981481,1]
[null,null,1,{"$f":"IF($X4=1,T4,\"\")","v":"HEWLEY"},{"$f":"IF($X4=1,U4,\"\")","v":292215},{"$f":"IF($X4=1,V4,\"\")","v":3240},{"$f":"IF($X4=1,W4,\"\")","v":"2003-11-08T19:16:01"},null,null,null,null,10,"COMPELL",138432,1687,"2002-12-22T00:09:37",null,5,6,"EPITEC",203091,4020,37613.124606481484,1]
[null,null,2,{"$f":"IF($X5=1,T5,\"\")","v":"Cheetah"},{"$f":"IF($X5=1,U5,\"\")","v":250226},{"$f":"IF($X5=1,V5,\"\")","v":4118},{"$f":"IF($X5=1,W5,\"\")","v":"2005-09-14T00:38:48"},null,null,null,null,5,"EPITEC",203091,4020,"2002-12-23T02:59:26",null,6,9,"Cheetah",180034,2027,38355.584791666668,1]
[null,null,3,"Cheetah",245796,2123,"2005-08-15T03:10:13",null,null,null,null,8,"HEWLEY",175021,2817,"2004-01-10T02:49:10",null,7,4,"HEWLEY",177371,1176,37610.925011574072,1]
{"$rows_left_out":540}
{"sheet":"Calculs","index":6,"n_rows":25,"n_cols":12,"rows_kept":25,"cut":false,"hidden":false,"merged":[[0,0,0,7],[19,6,19,7],[1,2,1,4],[3,0,3,2],[4,1,4,2]]}
[{"$f":"'Bureau Direction'!F1 & \"  -  Production possible\"","v":"Entreprise Cheetha  -  Production possible"}]
[null,"Liquidités yc dép. du mois","Matière + publicité unitaires"]
["Achats",{"$f":"'Bureau Direction'!H14","v":1000}," / ",{"$f":"'Bureau Direction'!AA24+VLOOKUP(Calculs!L19,Calculs!K20:L25,2)","v":50}," = ",{"$f":"INT(B3/D3)","v":20},"achats matière"]
["Publicité unitaire désirée : "]
[null,"Productivité : ",null,{"$f":"'Bureau Direction'!H15","v":5},null,{"$f":"F3*D5","v":100},"employés nécessaires"]
[]
[null,null,null,null,null,{"$f":"F5 - 'Bureau Direction'!L4","v":50},{"$f":"IF(F7>0,\"employés à engager\",\"employés à licencier\")","v":"employés à engager"}]
[]
["Tableau pour d'autres calculs"]
[]
{"$rows_left_out":16}
{"sheet":"Synthèse","index":7,"n_rows":32,"n_cols":18,"rows_kept":32,"cut":false,"hidden":false,"merged":[[0,0,0,13],[29,0,30,0],[31,0,32,0],[2,12,2,13],[2,10,2,11],[3,10,3,11],[3,12,3,13],[2,8,2,9],[4,11,4,12]]}
["Smak-money, feuille de route"]
[]
["Entreprise no : ",1,null,null,null,null,null,null,"Résultat global",null,"Cash flow *",null,{"$f":"SUM(B27:M27)","v":0}]
[null,null,null,null,null,null,null,null,null,null,"Ordi. vendus :",null,{"$f":"SUM(B26:M26)","v":0}]
["Date :","Heure de début et fin de partie :",null,null,null,null,null,null,null,null,null,"*sans les intérêts de :",null,{"$f":"ROUND(VLOOKUP($B$3,Datavar,24),0)","v":0},null,null,null,0]
["Température :",null,null,null,null,null,null,null,null,null,null,null,null,null,null,null,null,1]
[null,"1er janvier","1er février","1er mars","1er avril","1er mai","1er juin","1er juillet","1er août","1er sept.","1er octobre","1er nov.","1er déc.","Prochain mois",null,null,null,2]
["Situation de départ",null,null,null,null,null,null,null,null,null,null,null,null,null,null,null,null,3]
["Cash",null,null,null,null,null,null,null,null,null,null,null,null,null,null,null,null,4]
["Nombre d'ouvriers",null,null,null,null,null,null,null,null,null,null,null,null,null,null,null,null,0]
{"$rows_left_out":22}